{"text_format":"1","workbook":"xlsx","n_sheets":8,"sheets":["Form","MasterForm","originalForm","Footer","ClassificationClasses","Options","Rates","Comments"],"not_rendered":{"charts":0,"images":0,"macros":1,"external_links":1,"defined_names":20,"comments":1,"pivot_tables":0},"unopened":[],"bounds":{"document_bytes":16777216,"sheet_cells":100000,"rows_first":2000,"rows_last":500,"rows_between":2000,"halvings":0,"cell_chars":16384,"cell_head_chars":4096},"cells_cut":0,"cells_raw":0,"read":"whole","date_system":"1900"}

{"sheet":"Form","index":0,"n_rows":104,"n_cols":8,"rows_kept":104,"cut":false,"hidden":false,"merged":[[71,0,71,9],[72,0,73,3],[72,4,73,9],[74,0,75,3],[74,4,75,9],[76,0,77,3],[76,4,77,9],[79,0,80,3],[79,4,80,9],[29,0,29,3],[24,0,24,3],[25,0,25,3],[26,0,26,3],[27,0,27,3],[30,0,30,3],[31,0,31,3],[37,0,37,3],[35,0,35,3],[36,0,36,3],[33,0,33,3],[19,0,19,3],[19,4,19,6],[19,7,19,9],[15,0,15,3],[16,0,16,3],[14,0,14,3],[17,0,17,3],[23,0,23,3],[28,0,28,3],[20,7,20,9],[21,0,21,3],[20,0,20,3],[20,4,20,6],[12,4,12,9],[1,0,1,1],[1,2,1,9],[3,0,3,2],[3,3,3,9],[4,2,4,4],[4,5,4,6],[4,7,4,9],[5,0,5,1],[5,2,5,9],[6,0,6,6],[7,0,7,3],[7,4,7,9],[8,0,8,3],[4,0,4,1],[8,4,8,9],[9,0,9,3],[9,4,9,9],[10,0,10,3],[10,4,10,9],[11,0,11,3],[11,4,11,9],[12,0,12,3],[43,7,43,9],[46,0,46,3],[46,4,46,6],[46,7,46,9],[47,0,47,3],[47,4,47,6],[47,7,47,9],[44,0,44,3],[44,4,44,6],[44,7,44,9],[45,0,45,3],[45,4,45,6],[45,7,45,9],[67,0,67,3],[66,0,66,3],[65,0,65,3],[65,4,65,6],[65,7,65,9],[66,4,66,6],[66,7,66,9],[67,4,67,6],[67,7,67,9],[68,0,68,3],[68,4,68,6],[68,7,68,9],[69,0,69,3],[69,4,69,6],[69,7,69,9],[70,0,70,2],[70,3,70,4],[70,5,70,6],[39,0,39,3],[49,0,49,3],[49,4,49,6],[49,7,49,9],[50,0,50,3],[50,4,50,6],[50,7,50,9],[13,0,13,3],[13,4,13,9],[14,4,14,9],[15,4,15,9],[16,4,16,9],[17,4,17,9],[22,0,22,3],[32,0,32,3],[38,0,38,3],[48,0,48,3],[48,4,48,6],[48,7,48,9],[40,0,40,3],[41,0,41,3],[34,0,34,3],[43,0,43,3],[43,4,43,6],[51,0,51,3],[51,4,51,6],[51,7,51,9],[52,0,52,3],[52,4,52,6],[52,7,52,9],[53,0,53,3],[53,4,53,6],[53,7,53,9],[55,0,55,3],[55,4,55,6],[55,7,55,9],[56,0,56,3],[56,4,56,6],[56,7,56,9],[57,0,57,3],[57,4,57,6],[57,7,57,9],[64,7,64,9],[58,0,58,3],[58,4,58,6],[58,7,58,9],[61,0,61,3],[61,4,61,6],[61,7,61,9],[59,0,59,3],[59,4,59,6],[59,7,59,9],[39,4,39,9],[40,4,40,9],[91,0,92,3],[91,4,92,9],[94,0,95,3],[94,4,95,9],[97,0,98,3],[97,4,98,9],[100,0,101,3],[100,4,101,9],[83,0,84,3],[83,4,84,9],[86,0,86,3],[86,4,86,9],[87,0,87,3],[87,4,87,9],[62,0,62,3],[62,4,62,6],[62,7,62,9],[63,0,63,3],[63,4,63,6],[63,7,63,9],[64,0,64,3],[64,4,64,6],[41,4,41,9],[89,4,89,9],[81,0,81,3],[81,4,81,9],[103,0,109,3],[103,4,109,9],[21,4,21,9],[22,4,22,9],[23,4,23,9],[24,4,24,9],[25,4,25,9],[26,4,26,9],[27,4,27,9],[28,4,28,9],[29,4,29,9],[30,4,30,9],[31,4,31,9],[32,4,32,9],[33,4,33,9],[34,4,34,9],[35,4,35,9],[36,4,36,9],[37,4,37,9],[38,4,38,9]]}
[]
["Project name: ",null,"[structure  Project name: \"experimenter(s)_sponsor_name of the study\"]"]
[]
["General information"]
["Sponsor:",null,null,null,null,"Date first session:",null,"e.g. 14.01.2014"]
["Lead:"]
[]
["Cost Center:"]
["Special Ethics form applicable?"]
["Ethics commission number"]
["Classification class(es)"]
["Classification class(es)"]
["Classification class(es)"]
["Classification class(es)"]
["Classification class(es)"]
["Classification class(es)"]
["Classification class(es)"]
["Study Language:"]
[]
["Subjects",null,null,null,"Experiment",null,null,"Pilot"]
["Total number of subjects"]
["Expected payoff per subject (CHF)"]
["Will subjects be deceived?"]
["Recruiting support required?",null,null,null,"Yes"]
["Excluded field(s) of study"]
["Excluded field(s) of study"]
["Excluded field(s) of study"]
["Excluded field(s) of study"]
["Excluded field(s) of study"]
["Excluded field(s) of study"]
["Requested field(s) of study"]
["Requested field(s) of study"]
["Requested field(s) of study"]
["Requested field(s) of study"]
["Requested field(s) of study"]
["Requested field(s) of study"]
["Excluded classification(s) (former participations)"]
["Excluded classification(s) (former participations)"]
["Excluded classification(s) (former participations)"]
["Excluded classification(s) (former participations)"]
["Excluded classification(s) (former participations)"]
["Excluded classification(s) (former participations)"]
[]
["Resources",null,null,null,"Experiment",null,null,"Pilot"]
["Lab"]
["fMRI scanner [h]"]
["Scanning on Friday?",null,null,null,"No",null,null,"No"]
["SNS Behavioral lab [h]"]
["Pharma lab [h]"]
["TMS room [h]"]
["EEG room [h]"]
["Single Subject Room [h]"]
["EKG (TNU) [h]"]
["Behavioral lab [h]"]
[]
["Assistance and Equipment"]
["IT support"]
["Study conducted by:"]
[{"$f":"\"#Hours Hiwi support (Lab Assistance\" & IF(Rates!B10=\"Intern\", \"| Recruitment\", \"\") &  \")\"","v":"#Hours Hiwi support (Lab Assistance)"}]
["Other project expenses"]
{"$rows_left_out":45}
{"sheet":"MasterForm","index":1,"n_rows":82,"n_cols":12,"rows_kept":82,"cut":false,"hidden":true,"merged":[[67,7,67,9],[68,7,68,9],[69,7,69,9],[71,0,71,9],[61,7,61,9],[62,7,62,9],[63,7,63,9],[64,7,64,9],[65,7,65,9],[66,7,66,9],[62,4,62,6],[66,4,66,6],[67,4,67,6],[68,4,68,6],[69,4,69,6],[65,0,65,3],[66,0,66,3],[67,0,67,3],[68,0,68,3],[69,0,69,3],[70,3,70,4],[70,5,70,6],[63,0,63,3],[64,0,64,3],[81,4,82,9],[72,0,73,3],[74,0,75,3],[74,4,75,9],[72,4,73,9],[76,0,77,3],[76,4,77,9],[79,0,80,3],[79,4,80,9],[81,0,82,3],[58,7,58,9],[59,7,59,9],[43,4,43,6],[44,4,44,6],[45,4,45,6],[47,4,47,6],[48,4,48,6],[49,4,49,6],[51,7,51,9],[52,7,52,9],[55,7,55,9],[56,7,56,9],[57,7,57,9],[43,7,43,9],[44,7,44,9],[45,7,45,9],[47,7,47,9],[48,7,48,9],[49,7,49,9],[50,7,50,9],[55,4,55,6],[56,4,56,6],[57,4,57,6],[46,4,46,6],[13,0,13,3],[13,4,13,9],[12,0,12,3],[12,4,12,9],[21,4,21,9],[22,4,22,9],[10,0,10,3],[16,0,16,3],[17,0,17,3],[10,4,10,9],[16,4,16,9],[17,4,17,9],[19,7,19,9],[20,7,20,9],[11,0,11,3],[11,4,11,9],[46,0,46,3],[46,7,46,9],[15,0,15,3],[15,4,15,9],[14,0,14,3],[14,4,14,9],[30,4,30,9],[28,0,28,3],[27,0,27,3],[26,0,26,3],[23,4,23,9],[24,4,24,9],[25,4,25,9],[26,4,26,9],[27,4,27,9],[28,4,28,9],[29,4,29,9],[25,0,25,3],[24,0,24,3],[30,0,30,3],[23,0,23,3],[29,0,29,3],[20,4,20,6],[19,4,19,6],[53,4,53,6],[58,4,58,6],[31,4,31,9],[32,4,32,9],[33,4,33,9],[41,0,41,3],[40,0,40,3],[39,0,39,3],[49,0,49,3],[50,0,50,3],[48,0,48,3],[47,0,47,3],[34,4,34,9],[41,4,41,9],[38,0,38,3],[37,0,37,3],[36,0,36,3],[35,4,35,9],[36,4,36,9],[34,0,34,3],[33,0,33,3],[32,0,32,3],[31,0,31,3],[45,0,45,3],[6,0,6,6],[1,0,1,1],[3,0,3,2],[4,0,4,1],[4,2,4,4],[5,0,5,1],[44,0,44,3],[43,0,43,3],[35,0,35,3],[1,2,1,9],[3,3,3,9],[4,7,4,9],[5,2,5,9],[4,5,4,6],[7,4,7,9],[8,4,8,9],[9,4,9,9],[7,0,7,3],[8,0,8,3],[9,0,9,3],[19,0,19,3],[20,0,20,3],[21,0,21,3],[22,0,22,3],[37,4,37,9],[38,4,38,9],[39,4,39,9],[40,4,40,9],[70,0,70,2],[63,4,63,6],[64,4,64,6],[65,4,65,6],[53,7,53,9],[50,4,50,6],[61,0,61,3],[62,0,62,3],[61,4,61,6],[51,4,51,6],[52,4,52,6],[51,0,51,3],[52,0,52,3],[55,0,55,3],[56,0,56,3],[57,0,57,3],[58,0,58,3],[59,0,59,3],[59,4,59,6],[53,0,53,3]]}
[]
["Project name: ",null,"[structure  Project name: \"experimenter(s)_sponsor_name of the study\"]"]
[]
["General information"]
["Sponsor:",null,null,null,null,"Date first session:",null,"e.g. 14.01.2014"]
["Lead:"]
[]
["Cost Center:"]
["Special Ethics form applicable?"]
["Ethics commission number"]
["Classification class(es)"]
["Classification class(es)"]
["Classification class(es)"]
["Classification class(es)"]
["Classification class(es)"]
["Classification class(es)"]
["Classification class(es)"]
["Study Language:"]
[]
["Subjects",null,null,null,"Experiment",null,null,"Pilot"]
["Total number of subjects"]
["Expected payoff per subject (CHF)"]
["Will subjects be deceived?"]
["Recruiting support required?"]
["Excluded field(s) of study"]
["Excluded field(s) of study"]
["Excluded field(s) of study"]
["Excluded field(s) of study"]
["Excluded field(s) of study"]
["Excluded field(s) of study"]
["Requested field(s) of study"]
["Requested field(s) of study"]
["Requested field(s) of study"]
["Requested field(s) of study"]
["Requested field(s) of study"]
["Requested field(s) of study"]
["Excluded classification(s) (former participations)"]
["Excluded classification(s) (former participations)"]
["Excluded classification(s) (former participations)"]
["Excluded classification(s) (former participations)"]
["Excluded classification(s) (former participations)"]
["Excluded classification(s) (former participations)"]
[]
["Resources",null,null,null,"Experiment",null,null,"Pilot"]
["Lab"]
["fMRI scanner [h]",null,null,null,null,null,null,null,null,null,null,"SNS"]
["Scanning on Friday?",null,null,null,"No",null,null,"No",null,null,null,"SNS"]
["SNS Behavioral lab [h]",null,null,null,null,null,null,null,null,null,null,"SNS"]
["Pharma lab [h]",null,null,null,null,null,null,null,null,null,null,"SNS"]
["TMS room [h]",null,null,null,null,null,null,null,null,null,null,"SNS"]
["EEG room [h]",null,null,null,null,null,null,null,null,null,null,"SNS"]
["Single Subject Room [h]",null,null,null,null,null,null,null,null,null,null,"SNS"]
["EKG (TNU) [h]",null,null,null,null,null,null,null,null,null,null,"SNS"]
["Behavioral lab [h]",null,null,null,null,null,null,null,null,null,null,"ECON/Decil"]
[]
["Assistance and Equipment"]
["IT support"]
["Study conducted by:"]
[{"$f":"\"#Hours Hiwi support (Lab Assistance\" & IF(Rates!B10=\"Intern\", \"| Recruitment\", \"\") &  \")\"","v":"#Hours Hiwi support (Lab Assistance)"}]
["Other project expenses"]
{"$rows_left_out":23}
{"sheet":"originalForm","index":2,"n_rows":79,"n_cols":9,"rows_kept":79,"cut":false,"hidden":true,"merged":[[52,1,52,3],[53,4,53,7],[15,1,15,3],[33,1,33,3],[47,1,47,3],[47,4,47,5],[23,6,23,7],[20,1,20,3],[20,4,20,5],[42,6,42,7],[48,1,48,3],[43,1,43,3],[44,1,44,3],[16,4,16,5],[23,4,23,5],[25,4,25,5],[19,4,19,5],[30,4,30,5],[41,4,41,5],[40,4,40,5],[41,6,41,7],[25,6,25,7],[29,6,29,7],[30,6,30,7],[3,1,3,3],[25,1,25,3],[27,1,27,3],[11,1,11,3],[10,1,10,3],[8,1,8,3],[9,1,9,3],[7,1,7,3],[16,1,16,3],[14,1,14,3],[49,4,49,5],[7,4,7,5],[14,6,14,7],[14,4,14,5],[23,1,23,3],[20,6,20,7],[39,4,39,5],[29,1,29,3],[15,6,15,7],[42,4,42,5],[40,1,40,3],[35,4,35,5],[38,1,38,3],[39,1,39,3],[42,1,42,3],[35,1,35,3],[36,1,36,3],[19,1,19,3],[21,1,21,3],[41,1,41,3],[34,1,34,3],[30,1,30,3],[31,1,31,3],[29,4,29,5],[53,1,53,3],[55,4,55,7],[52,4,52,7],[18,6,18,7],[49,6,49,7],[43,6,43,7],[44,6,44,7],[54,4,54,7],[38,6,38,7],[35,6,35,7],[40,6,40,7],[27,6,27,7],[39,6,39,7],[31,4,31,5],[34,4,34,5],[43,4,43,5],[44,4,44,5],[47,6,47,7],[48,4,48,5],[51,1,51,7],[50,1,50,3],[50,4,50,5],[50,6,50,7],[49,1,49,3],[1,3,1,7],[1,1,1,2],[31,6,31,7],[6,1,6,7],[34,6,34,7],[19,6,19,7],[27,4,27,5],[11,4,11,7],[17,1,17,3],[17,4,17,5],[18,1,18,3],[16,6,16,7],[21,4,21,5],[18,4,18,5],[10,4,10,7],[5,1,5,2],[4,1,4,2],[4,3,4,5],[5,3,5,7],[7,6,7,7],[17,6,17,7],[12,1,12,3],[21,6,21,7],[15,4,15,5],[74,4,74,7],[76,1,76,3],[76,4,76,7],[78,4,78,7],[78,1,78,3],[63,1,63,3],[70,1,70,3],[70,4,70,7],[72,4,72,7],[72,1,72,3],[63,4,63,7],[57,4,57,7],[58,1,58,3],[24,1,24,3],[58,4,58,7],[56,1,56,3],[56,4,56,7],[54,1,54,3],[28,1,28,3],[24,6,24,7],[36,6,36,7],[36,4,36,5],[33,6,33,7],[28,4,28,5],[28,6,28,7],[24,4,24,5],[38,4,38,5],[37,1,37,3],[26,1,26,3],[26,4,26,5],[26,6,26,7],[32,1,32,3],[32,4,32,5],[33,4,33,5],[32,6,32,7]]}
[]
[null,"Project name: ",null,"[structure  Project name: \"experimenter(s)_sponsor_name of the study\"]"]
[]
[null,"General information"]
[null,"Sponsor:",null,null,null,null,"Date first session:"]
[null,"Lead:"]
[]
[null,"Cost Center:"]
[null,"Special Ethics form applicable?",null,null,null,null,null,null,"Box yes / no, damit aktiv angewählt werden muss"]
[null,"Ethics commission number",null,null,null,null,null,null,"erscheint, wenn yes in vorhergehender Zeile"]
[null,"Classification superclass",null,null,null,null,null,null,"Auswahl (keine Mehrfachnennungen möglich); Link zu Classification list (Cornelia fragen)"]
[null,"Classification subclass",null,null,null,null,null,null,"Auswahl (Mehrfachnennungen möglich); nur subclasses gemäss in obiger Zeile gewählten classes anzeigen"]
[null,"Study Language:",null,null,null,null,null,null,"Auswahl German, English"]
[]
[null,"Subjects",null,null,"Experiment",null,"Pilot"]
[null,"Total number of subjects"]
[null,"Expected payoff per subject (CHF)"]
[null,"Will subjects be deceived?",null,null,"Yes",null,"Yes",null,"Box yes / no, damit aktiv angewählt werden muss"]
[null,"Recruiting support required?",null,null,"Yes",null,"Yes",null,"Box yes / no, damit aktiv angewählt werden muss"]
[null,"Excluded field(s) of study",null,null,null,null,null,null,"Auswahl (Mehrfachnennungen möglich); erscheint, wenn yes in vorhergehender Zeile "]
[null,"Requested field(s) of study",null,null,null,null,null,null,"Auswahl (Mehrfachnennungen möglich); erscheint, wenn yes in vorvorhergehender Zeile "]
[null,"Excluded classification(s) (former participations)",null,null,null,null,null,null,"Auswahl (Mehrfachnennungen möglich); erscheint, wenn yes in vorvorvorhergehender Zeile "]
[]
[null,"Resources",null,null,"Experiment",null,"Pilot"]
[null,"Lab",null,null,null,null,null,null,"Auswahl: BLU Lab, SNS Lab, ETH Decision Lab; bei BLU und ETH soll das gleiche erscheinen"]
[null,"Number of hours fMRI scanner (external rate)"]
["SNS","fMRI scanner",null,null,null,null,null,null,"Box zum ankreuzen"]
["SNS","Number of hours fMRI scanner",null,null,null,null,null,null,"erscheint, wenn Box in vorhergehender Zeile angekreuzt wird"]
["SNS","Behavioral lab",null,null,null,null,null,null,"Box zum ankreuzen"]
["SNS","Pharma lab",null,null,null,null,null,null,"Box zum ankreuzen"]
["SNS","TMS room",null,null,null,null,null,null,"Box zum ankreuzen"]
["SNS","EEG room",null,null,null,null,null,null,"Box zum ankreuzen"]
["SNS","Single Subject Room",null,null,null,null,null,null,"Box zum ankreuzen"]
["SNS","EKG (TNU)",null,null,null,null,null,null,"Box zum ankreuzen"]
[]
[null,"Assistance and Equipment"]
[null,"IT support",null,null,null,null,null,null,"Auswahl: none, basic support, engineering"]
["BLU","Study conducted by:",null,null,null,null,null,null,"Auswahl: Experimenter only, Experimenter + Hiwi B, Hiwi A + Hiwi B"]
[null,"Number of hours Hiwi support"]
[null,"Other project expenses (specify=>comment)",null,null,0,null,0]
[]
[null,"Experimental Costs (CHF)",null,null,"Experiment",null,"Pilot"]
[null,"Total expected payoff for subjects",null,null,{"$f":"E16*E17","v":0},null,{"$f":"G16*G17","v":0},null,"= Total number of subjects * Expected payoff per subject (CHF)  "]
[null,"Hiwi support (CHF 30/h)",null,null,{"$f":"(E39*Student_Support)","v":{"$error":"#NAME?"}},null,{"$f":"(G39*Student_Support)","v":{"$error":"#NAME?"}},null,"= Hiwi support * 30"]
["SNS","fMRI scanner internal rate",null,null,{"$f":"240*E28","v":0},null,{"$f":"240*G28","v":0}]
[null,{"$f":"\"Behavrial Lab SNS (CHF \"&Behavrial_Lab&\")\"","v":{"$error":"#NAME?"}},null,null,null,{"$f":"#REF!*Behavrial_Lab","v":{"$error":"#REF!"}},null,{"$f":"#REF!*Behavrial_Lab","v":{"$error":"#REF!"}}]
[null,{"$f":"\"Behavrial Econ Lab (CHF \"&Behavrial_Lab&\")\"","v":{"$error":"#NAME?"}},null,null,null,{"$f":"#REF!*Behavrial_Lab","v":{"$error":"#REF!"}},null,{"$f":"#REF!*Behavrial_Lab","v":{"$error":"#REF!"}}]
["SNS","Recruitment support costs (appr. CHF 15/subject)",null,null,{"$f":"E16*15","v":0},null,{"$f":"G16*15","v":0}]
[null,"Other project expenses (=> comment)",null,null,{"$f":"SUM(E40)","v":0},null,null,{"$f":"SUM(G40)","v":0}]
[null,"Total",null,null,{"$f":"E43+E44+E45+E48+E49","v":{"$error":"#NAME?"}},null,{"$f":"G43+G44+G45+G48+H49","v":{"$error":"#NAME?"}}]
[]
[null,"Comments"]
[null,"Pilot"]
[null,"Experiment"]
[null,"General Remarks"]
[]
[null,"Date and Signature Sponsor"]
[]
[null,"Date and Signature Approval Presentation"]
[]
{"$rows_left_out":20}
{"sheet":"Footer","index":3,"n_rows":21,"n_cols":5,"rows_kept":21,"cut":false,"hidden":true,"merged":[[14,4,15,9],[17,4,18,9],[17,0,18,3],[20,0,26,3],[20,4,26,9],[14,0,15,3],[0,0,1,3],[0,4,1,9],[3,0,3,3],[4,0,4,3],[3,4,3,9],[4,4,4,9],[11,0,12,3],[11,4,12,9],[6,4,6,9],[8,4,9,9],[8,0,9,3]]}
["Money supply ",null,null,null,"Please note that only the study coordinator\nresp lab manager will provide you with money if necessary"]
[]
[]
["BLU experiments",null,null,null,"Cornelia Schnyder on request, at least 3 working days in advance"]
["Tresor access during experiments:",null,null,null,"Hiwis (lab assistants)"]
[]
["SNS experiments",null,null,null,"Ask Karl Treiber for more information"]
[]
["Test your  treatments",null,null,null,"* in the respective lab, if no sessions scheduled\n* in the testing lab"]
[]
[]
["Rules for testing treatments:",null,null,null,"You have to be informed about the processes in the lab and know how to use the technical devices resp. the standards of the specific lab"]
[]
[]
["First study in the lab:",null,null,null,"It is mandatory to have a hiwi during the first two sessions (xxx) to maintain our quality standards"]
[]
[]
["Booking sessions in the lab",null,null,null,"Please note that only the study coordinator can book a new study in zroot"]
[]
[]
["Rules for lab reservations:\n\nwe do not book any sessions if you do not \nfollow these rules\n",null,null,null,"* You need to hand in a signed resource form (this form)\n* lab bookings at least 14 days in advance\n* bookings on short notice only exeptionally accepted \n* only hiwis have access to the tresor during a session\n* if you have another cash supply than a hiwi, please indicate this on the resource form and plan accordingly\n* for fMRI, TMS and tDCS you need to prepare a questionnaire (telephone screening)"]

{"sheet":"ClassificationClasses","index":4,"n_rows":7,"n_cols":20,"rows_kept":7,"cut":false,"hidden":true,"merged":[]}
["SuperClass","Games: Common pool dilemmas","Games: Coordination Games","Games: Dictator games","Games: Honesty","Games: Market","Games: Miscellaneous single class","Games: Trust games","Games: Ultimatum-like games","Tasks: Cognitive tasks","Tasks: Emotion tasks","Tasks: Intertemporal choice tasks","Tasks: Miscellaneous single class","Tasks: Priming","Tasks: Risk assessment","Tasks: Simple value-based choice tasks","Tasks: Social Learning","Tasks: Social psychology tasks","OTHER game or task (not in list)","None"]
["SubClass","Prisoner's Dilemma","matching games - pure","Classical dictator game",null,"Price competition","Bargaining","Trust game - sequential","Ultimatum game - classical","Cognitive control","Emotion regulation","Titration table","Cognitive reflection task","Supraliminal priming","Devil's Task","Reinforcement learning","Success-based learning","Helping"]
[null,"Prisoner's Dilemma - Sequential","matching games - asymmetric","Generosity game",null,"Quantity competition","Centipede game","Promise game","Ultimatum game - variants","Executive function","Emotion recognition","Present/Future value equivalence","Werlog (roll a die and lie)","Subliminal priming","Holt Laury","Basic choice tasks",null,"Conformity"]
[null,"Public Goods Game","Stag Hunt Games","Distribution games",null,"General","Tournament / contest","Gift exchange game",null,"Attention","Mood induction",null,"Real Effort Task",null,"Other lotteries",null,null,"Moral judgment"]
[null,"Common Pool Extraction","Order-statistic production",null,null,"Private values",null,"Trust game - simultaneous",null,"Cognitive load","Self-report emotions"]
[null,null,null,null,null,"Common values",null,null,null,"Ego depletion"]
[null,null,null,null,null,"General equilibrium"]

{"sheet":"Options","index":5,"n_rows":9,"n_cols":7,"rows_kept":9,"cut":false,"hidden":true,"merged":[]}
["Description","Available Languages","Available Labs","Indicate who conducted the Experiment","Scanning support?","Is IT support needed?","Available Study Fields"]
["Title","Language","Lab","ConductedBy","Scanning","ItSupportType","FieldOfStudy"]
["Option1","German","BLU Lab","Experimenter only","qualified user","none","none"]
["…","English","SNS Lab","Experimenter + Hiwi","scanning assistance","basic support","Economics"]
["OptionN",null,"ETH Decision Lab","Hiwis only",null,"engineering","Psychology"]
[null,null,"Plattenstrasse 32",null,null,null,"Medicine"]
[null,null,null,null,null,null,"ETH Food Science"]
[null,null,null,null,null,null,"ETH Pharmacology"]
[null,null,null,null,null,null,"others"]

{"sheet":"Rates","index":6,"n_rows":12,"n_cols":3,"rows_kept":12,"cut":false,"hidden":true,"merged":[]}
["StudentSupport",30,"Student support hourly rate"]
["SubjectCost",10,"Experiment organization per subject"]
["FmriExternal",350,"fMRI scanner hourly rate (external)"]
["FmriInternal",240,"fMRI Scanner hourly rate (internal)"]
["ScanningAssistance",30,"Scanning assistance hourly rate"]
["ItSupport",40,"IT support hourly rate"]
["ServerSpace",0,"Serverspace for fMRI hourly rate"]
["BehavioralLabInternal",null,"Behavioral Lab hourly rate for internal use"]
["BehavioralLabExternal",100,"Behavioral Lab hourly rate for external use"]
["FormType","Extern"]
[]
["Change rates if it is external support"]

{"sheet":"Comments","index":7,"n_rows":2,"n_cols":1,"rows_kept":2,"cut":false,"hidden":true,"merged":[]}
[]
["Add here comments"]